Need Help?

CP2K DASHBOARD

NameHostStatusCommitSummaryLast OK
CSCS Daint (psmp)Alps Daint (CSCS)FAILED62906da (-5)correct: 6508 / 6511; wrong: 1; failed: 2; 4min47b47fb (-97)
CSCS Daint (psmp, H100)Alps Daint (CSCS)FAILED62906da (-5)correct: 6513 / 6515; failed: 2; 56min9ed1a31 (-105)
CSCS Eiger (ssmp)Alps Eiger (CSCS)FAILED62906da (-5)correct: 6395 / 6397; wrong: 1; failed: 1; 5min47b47fb (-97)
CSCS Eiger (psmp)Alps Eiger (CSCS)UNKNOWNN/AError while parsing report.47b47fb (-97)
PrecommitHZDROK31b3539 (0)Found 9697, skipped 0, checked 9697, and failed 0 files.
MiscHZDROK31b3539 (0)Miscellaneous tests passed
Coding conventionsHZDROK31b3539 (0)Found 0 issues (198 suppressed)
Spack (psmp, conventions)HZDROK62906da (-5)Found 0 issues (196 suppressed)
Current Toolchain (pdbg)HZDROK31b3539 (0)correct: 6516 / 6516; 29min (cached)
Current Toolchain (psmp)HZDRFAILED62906da (-5)correct: 6516 / 6517; failed: 1; 37min47b47fb (-97)
Current Toolchain (sdbg)HZDRFAILED31b3539 (0)correct: 6424 / 6424; slow: 1; 16min5430b5c (-10)
Current Toolchain (ssmp)HZDRFAILED62906da (-5)correct: 6366 / 6398; failed: 32; 22min82824c2 (-404)
Spack (pdbg)HZDROK62906da (-5)correct: 6511 / 6511; 28min
Spack (sdbg)HZDROK62906da (-5)correct: 6418 / 6418; 15min
Ubuntu, GCC 16 (ssmp)HZDRFAILED62906da (-5)correct: 4842 / 4843; failed: 1; 16min47b47fb (-97)
Ubuntu, GCC 15 (ssmp)HZDRFAILED62906da (-5)correct: 4842 / 4843; failed: 1; 16min47b47fb (-97)
Ubuntu, GCC 14 (ssmp)HZDRFAILED62906da (-5)correct: 4842 / 4843; failed: 1; 11min47b47fb (-97)
Ubuntu, GCC 13 (ssmp)HZDRFAILED62906da (-5)correct: 4842 / 4843; failed: 1; 16min47b47fb (-97)
Ubuntu, GCC 12 (ssmp)HZDRFAILED62906da (-5)correct: 4841 / 4843; wrong: 1; failed: 1; 16min47b47fb (-97)
Ubuntu, GCC 11 (ssmp)HZDRFAILED62906da (-5)correct: 4841 / 4843; wrong: 1; failed: 1; 16min9ed1a31 (-105)
Ubuntu, GCC 10 (ssmp)HZDRFAILED62906da (-5)correct: 4838 / 4842; wrong: 1; failed: 3; 16min9ed1a31 (-105)
Ubuntu, GCC 9 (ssmp)HZDRFAILED62906da (-5)correct: 4840 / 4843; wrong: 1; failed: 2; 12min47b47fb (-97)
Minimal buildHZDROK62906da (-5)correct: 3617 / 3617; 6min
CoverageHZDRFAILED62906da (-5)correct: 6516 / 6517; failed: 1; 21min47b47fb (-97)
Spack (psmp, coverage)HZDRFAILED62906da (-5)correct: 6511 / 6512; failed: 1; 21min47b47fb (-97)
Manual generationHZDROK62906da (-5)Manual generation works fine.
Doxygen generationHZDROK62906da (-5)Doxygen generation works fine.
ASE CalculatorHZDROK62906da (-5)ASE commit 3eb6aa9 works fine.
Spack (psmp, ASE)HZDROK62906da (-5)ASE commit 3eb6aa9 works fine
Direct Python interfaceHZDROK62906da (-5)Direct Python interface type checks and tests passed.
AiiDA-CP2K PluginHZDROK62906da (-5)aiida-cp2k commit ee49d91 works fine.
i-PiHZDROK62906da (-5)i-Pi commit 53f0e61 works fine.
PhonopyHZDROK62906da (-5)Phonopy commit a34d0a8 works fine.
Gromacs QM/MMHZDROK62906da (-5)Gromacs commit 1210900 works fine.
Spack (psmp, GROMACS)HZDRFAILED62906da (-5)Container build had non-zero exit status.b310db4 (-17)
Spack (psmp, performance OpenMP)HZDROK62906da (-5)Performance test took 54 minutes.
Performance OpenMPHZDROK62906da (-5)Performance test took 55 minutes.
Performance CUDA VoltaGCPOK62906da (-5)Performance test took 41 minutes.
Performance CUDA AmpereGCPOK62906da (-5)Performance test took 70 minutes.
ARM64GCPFAILED62906da (-5)correct: 6357 / 6359; failed: 2; 45min47b47fb (-97)
macOS on Apple M1 (psmp)MacStadiumFAILED94650f7 (-1)correct: 6509 / 6511; failed: 2; 61min47b47fb (-97)
Spack (ssmp, CUDA P100)GCPFAILED62906da (-5)correct: 572 / 612; wrong: 1; failed: 39; 100min2990480 (-418)
Spack (psmp, CUDA P100)GCPUNKNOWNN/AError while parsing report.N/A
CUDA Pascal (psmp)GCPFAILED62906da (-5)correct: 6194 / 6195; failed: 1; 117min47b47fb (-97)
CUDA Ampere (psmp)GCPFAILED62906da (-5)correct: 6186 / 6195; wrong: 2; failed: 7; 92minN/A
HIP ROCm build (psmp)HZDROK62906da (-5)Compilation works fine.
Intel oneAPI (ssmp, ifx)UZHFAILED62906da (-5)Compilation faileda0d6e0f (-304)
Intel oneAPI (psmp, ifx)UZHFAILED62906da (-5)Container build had non-zero exit status.6d276e9 (-302)
Intel oneAPI (ssmp, ifort)UZHFAILED62906da (-5)Compilation failed2990480 (-418)
Intel oneAPI (psmp, ifort)UZHFAILED62906da (-5)Container build had non-zero exit status.55d68b5 (-413)
Spack (ssmp)HZDRFAILED62906da (-5)correct: 6418 / 6419; failed: 1; 14min47b47fb (-97)
Spack (ssmp-static)HZDRFAILED62906da (-5)correct: 6242 / 6243; failed: 1; 13min47b47fb (-97)
Spack (OpenMPI, psmp)HZDRFAILED62906da (-5)correct: 6511 / 6512; failed: 1; 22min47b47fb (-97)
Spack (OpenMPI, pdbg)HZDROK62906da (-5)correct: 6511 / 6511; 32min
OpenMPI Toolchain (psmp)HZDRFAILED62906da (-5)correct: 6515 / 6517; wrong: 1; failed: 1; 34min9ed1a31 (-105)
Generic Toolchain (psmp)HZDRFAILED62906da (-5)correct: 6372 / 6373; failed: 1; 35min47b47fb (-97)
4 MPI ranks (psmp)HZDRFAILED62906da (-5)correct: 6520 / 6526; wrong: 5; failed: 1; 27min6c46d74 (-521)
Spack (psmp, 4x2)HZDRFAILED62906da (-5)correct: 6515 / 6521; wrong: 5; failed: 1; 42min55d68b5 (-413)
Fedora Toolchain (psmp)HZDRFAILED62906da (-5)correct: 6515 / 6517; wrong: 1; failed: 1; 34min47b47fb (-97)
Rawhide Toolchain (pdbg)HZDROK62906da (-5)correct: 6516 / 6516; 32min
Spack (pdbg, rawhide)HZDROK62906da (-5)correct: 6511 / 6511; 16min
Spack (psmp, fedora)HZDRFAILED62906da (-5)correct: 6510 / 6512; wrong: 1; failed: 1; 25min47b47fb (-97)
Spack (psmp, rockylinux)HZDRFAILED62906da (-5)correct: 6514 / 6516; wrong: 1; failed: 1; 30min47b47fb (-97)
Spack (psmp, opensuse)HZDRFAILED62906da (-5)correct: 6510 / 6512; wrong: 1; failed: 1; 30min9ed1a31 (-105)
Spack (psmp, GCC 16)HZDRFAILED62906da (-5)correct: 6510 / 6512; wrong: 1; failed: 1; 23min47b47fb (-97)
Spack (psmp, GCC 15)HZDRFAILED62906da (-5)correct: 6511 / 6512; failed: 1; 24min47b47fb (-97)
Spack (psmp, GCC 14)HZDRFAILED62906da (-5)correct: 6510 / 6512; wrong: 1; failed: 1; 20min47b47fb (-97)
Spack (psmp, GCC 13)HZDRFAILED62906da (-5)correct: 6510 / 6512; wrong: 1; failed: 1; 22min9ed1a31 (-105)
Spack (psmp, GCC 12)HZDRFAILED62906da (-5)Container build had non-zero exit status.47b47fb (-97)
Spack (psmp, GCC 11)HZDRFAILED62906da (-5)correct: 6514 / 6516; wrong: 1; failed: 1; 24min47b47fb (-97)
Spack (psmp, GCC 10)HZDRFAILED62906da (-5)correct: 6366 / 6369; wrong: 1; failed: 2; 23min47b47fb (-97)
Address SanitizerHZDROK62906da (-5)correct: 6501 / 6501; 94min

Page last updated: 2026-10-24T23:15:22+00:00