Need Help?

CP2K DASHBOARD

NameHostStatusCommitSummaryLast OK
CSCS Daint (psmp)Alps Daint (CSCS)FAILED31b3539 (-13)correct: 6508 / 6511; wrong: 1; failed: 2; 4min47b47fb (-110)
CSCS Daint (psmp, H100)Alps Daint (CSCS)FAILED31b3539 (-13)correct: 6536 / 6538; failed: 2; 53min9ed1a31 (-118)
CSCS Eiger (ssmp)Alps Eiger (CSCS)FAILED31b3539 (-13)correct: 6418 / 6419; failed: 1; 5min47b47fb (-110)
CSCS Eiger (psmp)Alps Eiger (CSCS)FAILED31b3539 (-13)correct: 6511 / 6512; failed: 1; 8min47b47fb (-110)
PrecommitHZDROK6344619 (0)Found 9697, skipped 0, checked 9697, and failed 0 files.
MiscHZDROK6344619 (0)Miscellaneous tests passed
Coding conventionsHZDROK6344619 (0)Found 0 issues (197 suppressed)
Spack (psmp, conventions)HZDROK31b3539 (-13)Found 0 issues (196 suppressed)
Current Toolchain (pdbg)HZDROK6344619 (0)correct: 6515 / 6515; 31min
Current Toolchain (psmp)HZDRFAILED31b3539 (-13)correct: 6516 / 6517; failed: 1; 39min47b47fb (-110)
Current Toolchain (sdbg)HZDRFAILED6344619 (0)correct: 6423 / 6423; slow: 3; 17min90a4ed6 (-4)
Current Toolchain (ssmp)HZDRFAILED31b3539 (-13)correct: 6365 / 6398; wrong: 1; failed: 32; 17min82824c2 (-417)
Spack (pdbg)HZDROK31b3539 (-13)correct: 6511 / 6511; 26min
Spack (sdbg)HZDROK31b3539 (-13)correct: 6418 / 6418; 14min
Ubuntu, GCC 16 (ssmp)HZDRFAILED31b3539 (-13)correct: 4842 / 4843; failed: 1; 12min47b47fb (-110)
Ubuntu, GCC 15 (ssmp)HZDRFAILED31b3539 (-13)correct: 4842 / 4843; failed: 1; 12min47b47fb (-110)
Ubuntu, GCC 14 (ssmp)HZDRFAILED31b3539 (-13)correct: 4842 / 4843; failed: 1; 11min47b47fb (-110)
Ubuntu, GCC 13 (ssmp)HZDRFAILED31b3539 (-13)correct: 4842 / 4843; failed: 1; 11min47b47fb (-110)
Ubuntu, GCC 12 (ssmp)HZDRFAILED31b3539 (-13)correct: 4842 / 4843; failed: 1; 12min47b47fb (-110)
Ubuntu, GCC 11 (ssmp)HZDRFAILED31b3539 (-13)correct: 4841 / 4843; wrong: 1; failed: 1; 12min9ed1a31 (-118)
Ubuntu, GCC 10 (ssmp)HZDRFAILED31b3539 (-13)correct: 4839 / 4843; wrong: 2; failed: 2; 14min9ed1a31 (-118)
Ubuntu, GCC 9 (ssmp)HZDRFAILED31b3539 (-13)correct: 4840 / 4843; wrong: 1; failed: 2; 12min47b47fb (-110)
Minimal buildHZDROK31b3539 (-13)correct: 3617 / 3617; 5min
CoverageHZDRFAILED31b3539 (-13)correct: 6516 / 6517; failed: 1; 22min47b47fb (-110)
Spack (psmp, coverage)HZDRFAILED31b3539 (-13)correct: 6511 / 6512; failed: 1; 20min47b47fb (-110)
Manual generationHZDROK31b3539 (-13)Manual generation works fine.
Doxygen generationHZDROK31b3539 (-13)Doxygen generation works fine.
ASE CalculatorHZDROK31b3539 (-13)ASE commit 1ee9782 works fine.
Spack (psmp, ASE)HZDROK31b3539 (-13)ASE commit 1ee9782 works fine
Direct Python interfaceHZDROK31b3539 (-13)Direct Python interface type checks and tests passed.
AiiDA-CP2K PluginHZDROK31b3539 (-13)aiida-cp2k commit ee49d91 works fine.
i-PiHZDROK31b3539 (-13)i-Pi commit 93162d2 works fine.
PhonopyHZDROK31b3539 (-13)Phonopy commit c82ab36 works fine.
Gromacs QM/MMHZDROK31b3539 (-13)Gromacs commit 1210900 works fine.
Spack (psmp, GROMACS)HZDRFAILED31b3539 (-13)Container build had non-zero exit status.b310db4 (-30)
Spack (psmp, performance OpenMP)HZDROK31b3539 (-13)Performance test took 56 minutes.
Performance OpenMPHZDROK31b3539 (-13)Performance test took 52 minutes.
Performance CUDA VoltaGCPOK31b3539 (-13)Performance test took 42 minutes.
Performance CUDA AmpereGCPOK31b3539 (-13)Performance test took 69 minutes.
ARM64GCPFAILED31b3539 (-13)correct: 6357 / 6359; failed: 2; 45min47b47fb (-110)
macOS on Apple M1 (psmp)MacStadiumFAILED31b3539 (-13)correct: 6509 / 6511; failed: 2; 61min47b47fb (-110)
Spack (ssmp, CUDA P100)GCPFAILED31b3539 (-13)correct: 572 / 612; wrong: 3; failed: 37; 110min2990480 (-431)
Spack (psmp, CUDA P100)GCPFAILED31b3539 (-13)correct: 589 / 631; wrong: 3; failed: 39; 148minN/A
CUDA Pascal (psmp)GCPFAILED31b3539 (-13)correct: 6194 / 6195; failed: 1; 119min47b47fb (-110)
CUDA Ampere (psmp)GCPFAILED31b3539 (-13)correct: 6186 / 6195; wrong: 2; failed: 7; 94minN/A
HIP ROCm build (psmp)HZDROK31b3539 (-13)Compilation works fine.
Intel oneAPI (ssmp, ifx)UZHFAILED31b3539 (-13)Compilation faileda0d6e0f (-317)
Intel oneAPI (psmp, ifx)UZHFAILED31b3539 (-13)Container build had non-zero exit status.6d276e9 (-315)
Intel oneAPI (ssmp, ifort)UZHFAILED31b3539 (-13)Compilation failed2990480 (-431)
Intel oneAPI (psmp, ifort)UZHFAILED31b3539 (-13)Container build had non-zero exit status.55d68b5 (-426)
Spack (ssmp)HZDRFAILED31b3539 (-13)correct: 6418 / 6419; failed: 1; 11min47b47fb (-110)
Spack (ssmp-static)HZDRFAILED31b3539 (-13)correct: 6242 / 6243; failed: 1; 11min47b47fb (-110)
Spack (OpenMPI, psmp)HZDRFAILED31b3539 (-13)correct: 6511 / 6512; failed: 1; 30min47b47fb (-110)
Spack (OpenMPI, pdbg)HZDROK31b3539 (-13)correct: 6511 / 6511; 27min
OpenMPI Toolchain (psmp)HZDRFAILED31b3539 (-13)correct: 6516 / 6517; failed: 1; 39min9ed1a31 (-118)
Generic Toolchain (psmp)HZDRFAILED31b3539 (-13)correct: 6372 / 6373; failed: 1; 33min47b47fb (-110)
4 MPI ranks (psmp)HZDRFAILED31b3539 (-13)correct: 6520 / 6526; wrong: 5; failed: 1; 27min6c46d74 (-534)
Spack (psmp, 4x2)HZDRFAILED31b3539 (-13)correct: 6515 / 6521; wrong: 5; failed: 1; 39min55d68b5 (-426)
Fedora Toolchain (psmp)HZDRFAILED31b3539 (-13)correct: 6515 / 6517; wrong: 1; failed: 1; 39min47b47fb (-110)
Rawhide Toolchain (pdbg)HZDROK31b3539 (-13)correct: 6516 / 6516; 31min
Spack (pdbg, rawhide)HZDROK31b3539 (-13)correct: 6511 / 6511; 19min
Spack (psmp, fedora)HZDRFAILED31b3539 (-13)correct: 6510 / 6512; wrong: 1; failed: 1; 24min47b47fb (-110)
Spack (psmp, rockylinux)HZDRFAILED31b3539 (-13)correct: 6514 / 6516; wrong: 1; failed: 1; 24min47b47fb (-110)
Spack (psmp, opensuse)HZDRFAILED31b3539 (-13)correct: 6510 / 6512; wrong: 1; failed: 1; 30min9ed1a31 (-118)
Spack (psmp, GCC 16)HZDRFAILED31b3539 (-13)correct: 6510 / 6512; wrong: 1; failed: 1; 25min47b47fb (-110)
Spack (psmp, GCC 15)HZDRFAILED31b3539 (-13)correct: 6511 / 6512; failed: 1; 26min47b47fb (-110)
Spack (psmp, GCC 14)HZDRFAILED31b3539 (-13)correct: 6510 / 6512; wrong: 1; failed: 1; 20min47b47fb (-110)
Spack (psmp, GCC 13)HZDRFAILED31b3539 (-13)correct: 6510 / 6512; wrong: 1; failed: 1; 26min9ed1a31 (-118)
Spack (psmp, GCC 12)HZDRFAILED31b3539 (-13)correct: 6514 / 6516; wrong: 1; failed: 1; 22min47b47fb (-110)
Spack (psmp, GCC 11)HZDRFAILED31b3539 (-13)correct: 6514 / 6516; wrong: 1; failed: 1; 30min47b47fb (-110)
Spack (psmp, GCC 10)HZDRFAILED31b3539 (-13)correct: 6365 / 6369; wrong: 2; failed: 2; 25min47b47fb (-110)
Address SanitizerHZDROK31b3539 (-13)correct: 6501 / 6501; 95min

Page last updated: 2026-10-25T20:05:18+00:00